Reaction Details
TargetDual specificity protein phosphatase 3
LigandBDBM34347
Substrate/Competitorn/a
Meas. Tech.SAR VHR1 Fluorescent Assay for In Vitro dose response studies
IC50>99000±n/a nM
Citation PubChem, PC SAR VHR1 Fluorescent Assay for In Vitro dose response studies PubChem Bioassay(2009)[AID]
 
Dual specificity protein phosphatase 3
Name:Dual specificity protein phosphatase 3
Type:Hydrolase
Mol. Mass.:20480.58
Organism:Homo sapiens (Human)
Description:n/a
Residue:185
BDBM34347
NameBDBM34347
Synonyms:MLS000056753 [4-amino-3-(3-methylphenyl)-2-sulfanylidene-1,3-thiazol-5-yl]-(4-methylpiperazin-1-yl)methanone [4-amino-3-(m-tolyl)-2-thioxo-4-thiazolin-5-yl]-(4-methylpiperazino)methanone cid_3000187
TypeSmall organic molecule
Emp. Form.C16H20N4OS2
Mol. Mass.348.486
SMILESCN1CCN(CC1)C(=O)c1sc(=S)n(c1N)-c1cccc(C)c1