Reaction Details
TargetDual specificity protein phosphatase 3
LigandBDBM46212
Substrate/Competitorn/a
Meas. Tech.SAR VHR1 absorbance Assay for In Vitro dose response studies.
IC50 2400±n/a nM
Citation PubChem, PC SAR VHR1 absorbance Assay for In Vitro dose response studies. PubChem Bioassay(2009)[AID]
 
Dual specificity protein phosphatase 3
Name:Dual specificity protein phosphatase 3
Type:Hydrolase
Mol. Mass.:20480.58
Organism:Homo sapiens (Human)
Description:n/a
Residue:185
BDBM46212
NameBDBM46212
Synonyms:2-[2-chloranyl-6-methoxy-4-[(Z)-[3-[2-[(4-methylphenyl)amino]-2-oxidanylidene-ethyl]-2,4-bis(oxidanylidene)-1,3-thiazolidin-5-ylidene]methyl]phenoxy]ethanoic acid 2-[2-chloro-6-methoxy-4-[(Z)-[3-[2-(4-methylanilino)-2-oxoethyl]-2,4-dioxo-1,3-thiazolidin-5-ylidene]methyl]phenoxy]acetic acid MLS-0350105.0001 | cid_9512029
TypeSmall organic molecule
Emp. Form.C22H19ClN2O7S
Mol. Mass.490.913
SMILESCOc1cc(\C=C2/SC(=O)N(CC(=O)Nc3ccc(C)cc3)C2=O)cc(Cl)c1OCC(O)=O