Reaction Details
TargetMatrix metalloproteinase-14 [1-36]
LigandBDBM40322
Substrate/Competitorn/a
Meas. Tech.Luminescent HTS for small molecule inhibitors of MT1-MMP transcription
EC50 10500±n/a nM
Citation PubChem, PC Luminescent HTS for small molecule inhibitors of MT1-MMP transcription PubChem Bioassay(2008)[AID]
 
Matrix metalloproteinase-14 [1-36]
Name:Matrix metalloproteinase-14 [1-36]
Type:Enzyme Catalytic Domain
Mol. Mass.:3658.23
Organism:Homo sapiens (Human)
Description:gi_6690534
Residue:36
BDBM40322
NameBDBM40322
Synonyms:2-(1-benzotriazolyl)-3-(4-morpholinyl)naphthalene-1,4-dione 2-(benzotriazol-1-yl)-3-morpholin-4-ylnaphthalene-1,4-dione 2-Benzotriazol-1-yl-3-morpholin-4-yl-[1,4]naphthoquinone SMR000147150 | cid_1405137
TypeSmall organic molecule
Emp. Form.C20H16N4O3
Mol. Mass.360.366
SMILESO=C1C(N2CCOCC2)=C(C(=O)c2ccccc12)n1nnc2ccccc12