Reaction Details
TargetEukaryotic translation initiation factor 4 gamma 1
LigandBDBM31758
Substrate/Competitorn/a
Meas. Tech.Dose Response Confirmation for Small Molecule Inhibitors of Eukaryotic Translation Initiation
IC50 5439.744795±n/a nM
Citation PubChem, PC Dose Response Confirmation for Small Molecule Inhibitors of Eukaryotic Translation Initiation PubChem Bioassay(2009)[AID]
 
Eukaryotic translation initiation factor 4 gamma 1
Name:Eukaryotic translation initiation factor 4 gamma 1
Type:Enzyme Catalytic Domain
Mol. Mass.:175455.17
Organism:Homo sapiens (Human)
Description:Q04637
Residue:1599
BDBM31758
NameBDBM31758
Synonyms:8-methyl-3a,4,5,9b-tetrahydro-3H-cyclopenta[c]quinoline-4-carboxylic acid cid_646096
TypeSmall organic molecule
Emp. Form.C14H15NO2
Mol. Mass.229.2744
SMILESCc1ccc2NC(C3CC=CC3c2c1)C(O)=O