Reaction Details
TargetEukaryotic translation initiation factor 4 gamma 1
LigandBDBM31756
Substrate/Competitorn/a
Meas. Tech.Dose Response Confirmation for Small Molecule Inhibitors of Eukaryotic Translation Initiation
IC50 8683.131109±n/a nM
Citation PubChem, PC Dose Response Confirmation for Small Molecule Inhibitors of Eukaryotic Translation Initiation PubChem Bioassay(2009)[AID]
 
Eukaryotic translation initiation factor 4 gamma 1
Name:Eukaryotic translation initiation factor 4 gamma 1
Type:Enzyme Catalytic Domain
Mol. Mass.:175455.17
Organism:Homo sapiens (Human)
Description:Q04637
Residue:1599
BDBM31756
NameBDBM31756
Synonyms:6,7-dimethyl-3a,4,5,9b-tetrahydro-3H-cyclopenta[c]quinoline-4-carboxylic acid cid_646406
TypeSmall organic molecule
Emp. Form.C15H17NO2
Mol. Mass.243.301
SMILESCc1ccc2C3C=CCC3C(Nc2c1C)C(O)=O