Reaction Details
TargetEukaryotic translation initiation factor 4 gamma 1
LigandBDBM37044
Substrate/Competitorn/a
Meas. Tech.Dose Response Confirmation for Small Molecule Inhibitors of Eukaryotic Translation Initiation
IC50 15740.50148±n/a nM
Citation PubChem, PC Dose Response Confirmation for Small Molecule Inhibitors of Eukaryotic Translation Initiation PubChem Bioassay(2009)[AID]
 
Eukaryotic translation initiation factor 4 gamma 1
Name:Eukaryotic translation initiation factor 4 gamma 1
Type:Enzyme Catalytic Domain
Mol. Mass.:175455.17
Organism:Homo sapiens (Human)
Description:Q04637
Residue:1599
BDBM37044
NameBDBM37044
Synonyms:3-[(dimethylamino)sulfonyl]-1-methyl-1H-imidazol-3-ium SMR000033776 tetraphenylboranuide;N,N,3-trimethyl-1-imidazol-3-iumsulfonamide | tetraphenylboranuide;N,N,3-trimethylimidazol-3-ium-1-sulfonamide
TypeSmall organic molecule
Emp. Form.C24H20B
Mol. Mass.319.227
SMILESc1ccc(cc1)[B-](c1ccccc1)(c1ccccc1)c1ccccc1