Reaction Details
TargetEukaryotic translation initiation factor 4 gamma 1
LigandBDBM50244216
Substrate/Competitorn/a
Meas. Tech.Dose Response Confirmation for Small Molecule Inhibitors of Eukaryotic Translation Initiation
IC50 6200.028677±n/a nM
Citation PubChem, PC Dose Response Confirmation for Small Molecule Inhibitors of Eukaryotic Translation Initiation PubChem Bioassay(2009)[AID]
 
Eukaryotic translation initiation factor 4 gamma 1
Name:Eukaryotic translation initiation factor 4 gamma 1
Type:Enzyme Catalytic Domain
Mol. Mass.:175455.17
Organism:Homo sapiens (Human)
Description:Q04637
Residue:1599
BDBM50244216
NameBDBM50244216
Synonyms:2,3-dihydropyrrolo[2,1-b]quinazolin-9(1H)-one cid_68261
TypeSmall organic molecule
Emp. Form.C11H10N2O
Mol. Mass.186.2099
SMILESO=c1n2CCCc2nc2ccccc12