Reaction Details
TargetEukaryotic translation initiation factor 4 gamma 1
LigandBDBM32280
Substrate/Competitorn/a
Meas. Tech.Dose Response Confirmation for Small Molecule Inhibitors of Eukaryotic Translation Initiation
IC50 64000±n/a nM
Citation PubChem, PC Dose Response Confirmation for Small Molecule Inhibitors of Eukaryotic Translation Initiation PubChem Bioassay(2009)[AID]
 
Eukaryotic translation initiation factor 4 gamma 1
Name:Eukaryotic translation initiation factor 4 gamma 1
Type:Enzyme Catalytic Domain
Mol. Mass.:175455.17
Organism:Homo sapiens (Human)
Description:Q04637
Residue:1599
BDBM32280
NameBDBM32280
Synonyms:MLS000534769 N-(4-acetylphenyl)-2,3-bis(2-furyl)quinoxaline-6-carboxamide N-(4-acetylphenyl)-2,3-di-2-furyl-6-quinoxalinecarboxamide SMR000142225 | cid_1331726
TypeSmall organic molecule
Emp. Form.C25H17N3O4
Mol. Mass.423.4202
SMILESCC(=O)c1ccc(NC(=O)c2ccc3nc(-c4ccco4)c(nc3c2)-c2ccco2)cc1