Reaction Details
TargetEukaryotic translation initiation factor 4 gamma 1
LigandBDBM48813
Substrate/Competitorn/a
Meas. Tech.Dose Response Confirmation for Small Molecule Inhibitors of Eukaryotic Translation Initiation
IC50 16420±n/a nM
Citation PubChem, PC Dose Response Confirmation for Small Molecule Inhibitors of Eukaryotic Translation Initiation PubChem Bioassay(2009)[AID]
 
Eukaryotic translation initiation factor 4 gamma 1
Name:Eukaryotic translation initiation factor 4 gamma 1
Type:Enzyme Catalytic Domain
Mol. Mass.:175455.17
Organism:Homo sapiens (Human)
Description:Q04637
Residue:1599
BDBM48813
NameBDBM48813
Synonyms:2-chloranyl-5-[5-[(Z)-[3-[(4-methoxyphenyl)methyl]-4-oxidanylidene-2-sulfanylidene-1,3-thiazolidin-5-ylidene]methyl]furan-2-yl]benzoic acid 2-chloro-5-[5-[(Z)-(4-keto-3-p-anisyl-2-thioxo-thiazolidin-5-ylidene)methyl]-2-furyl]benzoic acid 2-chloro-5-[5-[(Z)-[3-[(4-methoxyphenyl)methyl]-4-oxo-2-sulfanylidene-5-thiazolidinylidene]methyl]-2-furanyl]benzoic acid SMR000298745 | cid_2285453
TypeSmall organic molecule
Emp. Form.C23H16ClNO5S2
Mol. Mass.485.96
SMILESCOc1ccc(CN2C(=S)S\C(=C/c3ccc(o3)-c3ccc(Cl)c(c3)C(O)=O)C2=O)cc1