Reaction Details
TargetEukaryotic translation initiation factor 4 gamma 1
LigandBDBM48816
Substrate/Competitorn/a
Meas. Tech.Dose Response Confirmation for Small Molecule Inhibitors of Eukaryotic Translation Initiation
IC50 13130±n/a nM
Citation PubChem, PC Dose Response Confirmation for Small Molecule Inhibitors of Eukaryotic Translation Initiation PubChem Bioassay(2009)[AID]
 
Eukaryotic translation initiation factor 4 gamma 1
Name:Eukaryotic translation initiation factor 4 gamma 1
Type:Enzyme Catalytic Domain
Mol. Mass.:175455.17
Organism:Homo sapiens (Human)
Description:Q04637
Residue:1599
BDBM48816
NameBDBM48816
Synonyms:MLS000334839 N-[5-[(4-cyanophenyl)methylsulfanyl]-1,3,4-thiadiazol-2-yl]-1,3-benzothiazole-6-carboxamide SMR000249597 | cid_2452051
TypeSmall organic molecule
Emp. Form.C18H11N5OS3
Mol. Mass.409.508
SMILESO=C(Nc1nnc(SCc2ccc(cc2)C#N)s1)c1ccc2ncsc2c1