Reaction Details
TargetTranscription factor p65
LigandBDBM49291
Substrate/Competitorn/a
Meas. Tech.Name: High Throughput Screen to Identify Compounds that increase expression of NF-kB in Human Neuronal Cells - Dose Response
EC50 2499±n/a nM
Citation PubChem, PC Name: High Throughput Screen to Identify Compounds that increase expression of NF-kB in Human Neuronal Cells - Dose Response PubChem Bioassay(2008)[AID]
 
Transcription factor p65
Name:Transcription factor p65
Type:Enzyme
Mol. Mass.:60211.92
Organism:Homo sapiens (Human)
Description:Q04206
Residue:551
BDBM49291
NameBDBM49291
Synonyms:MLS000061602 N-[4-(diethylamino)phenyl]-2-furancarboxamide SMR000069932 | cid_675057
TypeSmall organic molecule
Emp. Form.C15H18N2O2
Mol. Mass.258.3156
SMILESCCN(CC)c1ccc(NC(=O)c2ccco2)cc1