Reaction Details
TargetInduced myeloid leukemia cell differentiation protein Mcl-1
LigandBDBM36880
Substrate/Competitorn/a
Meas. Tech.Dose Response Confirmation for Mcl-1/Noxa Interaction Inhibitors
IC50 1898.886526±n/a nM
Citation PubChem, PC Dose Response Confirmation for Mcl-1/Noxa Interaction Inhibitors PubChem Bioassay(2008)[AID]
 
Induced myeloid leukemia cell differentiation protein Mcl-1
Name:Induced myeloid leukemia cell differentiation protein Mcl-1
Type:Membrane; Single-pass membrane protein
Mol. Mass.:37332.87
Organism:Homo sapiens (Human)
Description:Q07820
Residue:350
BDBM36880
NameBDBM36880
Synonyms:2,2'-THIOBIS(4,6-DICHLOROPHENOL) 2,4-dichloro-6-[(3,5-dichloro-2-hydroxy-phenyl)thio]phenol 2-[3,5-bis(chloranyl)-2-oxidanyl-phenyl]sulfanyl-4,6-bis(chloranyl)phenol HL-3 SMR000058374 | cid_2406
TypeSmall organic molecule
Emp. Form.C12H6Cl4O2S
Mol. Mass.356.052
SMILESOc1c(Cl)cc(Cl)cc1Sc1cc(Cl)cc(Cl)c1O