Reaction Details
TargetInduced myeloid leukemia cell differentiation protein Mcl-1
LigandBDBM31750
Substrate/Competitorn/a
Meas. Tech.Dose Response Confirmation for Mcl-1/Noxa Interaction Inhibitors
IC50 8015.837232±n/a nM
Citation PubChem, PC Dose Response Confirmation for Mcl-1/Noxa Interaction Inhibitors PubChem Bioassay(2008)[AID]
 
Induced myeloid leukemia cell differentiation protein Mcl-1
Name:Induced myeloid leukemia cell differentiation protein Mcl-1
Type:Membrane; Single-pass membrane protein
Mol. Mass.:37332.87
Organism:Homo sapiens (Human)
Description:Q07820
Residue:350
BDBM31750
NameBDBM31750
Synonyms:5,6-bis(2-furanyl)-3-(methylthio)-1,2,4-triazine 5,6-bis(furan-2-yl)-3-methylsulfanyl-1,2,4-triazine cid_3053058
TypeSmall organic molecule
Emp. Form.C12H9N3O2S
Mol. Mass.259.284
SMILESCSc1nnc(-c2ccco2)c(n1)-c1ccco1