Reaction Details
TargetInduced myeloid leukemia cell differentiation protein Mcl-1
LigandBDBM35379
Substrate/Competitorn/a
Meas. Tech.Dose Response Confirmation for Mcl-1/Noxa Interaction Inhibitors
IC50 2591.202711±n/a nM
Citation PubChem, PC Dose Response Confirmation for Mcl-1/Noxa Interaction Inhibitors PubChem Bioassay(2008)[AID]
 
Induced myeloid leukemia cell differentiation protein Mcl-1
Name:Induced myeloid leukemia cell differentiation protein Mcl-1
Type:Membrane; Single-pass membrane protein
Mol. Mass.:37332.87
Organism:Homo sapiens (Human)
Description:Q07820
Residue:350
BDBM35379
NameBDBM35379
Synonyms:2-(2-furanyl)-4-quinolinecarboxylic acid [2-[4-amino-1-methyl-3-(2-methylpropyl)-2,6-dioxo-5-pyrimidinyl]-2-oxoethyl] ester MLS000058168 [2-[4-amino-1-methyl-3-(2-methylpropyl)-2,6-dioxopyrimidin-5-yl]-2-oxoethyl] 2-(furan-2-yl)quinoline-4-carboxylate cid_2094474
TypeSmall organic molecule
Emp. Form.C25H24N4O6
Mol. Mass.476.4813
SMILESCC(C)Cn1c(N)c(C(=O)COC(=O)c2cc(nc3ccccc23)-c2ccco2)c(=O)n(C)c1=O