Reaction Details
TargetInduced myeloid leukemia cell differentiation protein Mcl-1
LigandBDBM49153
Substrate/Competitorn/a
Meas. Tech.Dose Response Confirmation for Mcl-1/Noxa Interaction Inhibitors
IC50 2107.557059±n/a nM
Citation PubChem, PC Dose Response Confirmation for Mcl-1/Noxa Interaction Inhibitors PubChem Bioassay(2008)[AID]
 
Induced myeloid leukemia cell differentiation protein Mcl-1
Name:Induced myeloid leukemia cell differentiation protein Mcl-1
Type:Membrane; Single-pass membrane protein
Mol. Mass.:37332.87
Organism:Homo sapiens (Human)
Description:Q07820
Residue:350
BDBM49153
NameBDBM49153
Synonyms:MLS000530403 N-[1-(1,3-diketoindan-2-yl)ethylideneamino]-3-hydroxy-2-naphthamide N-[1-(1,3-dioxoinden-2-yl)ethylideneamino]-3-hydroxynaphthalene-2-carboxamide SMR000135380 | cid_1010001
TypeSmall organic molecule
Emp. Form.C22H16N2O4
Mol. Mass.372.3734
SMILES[#6]\[#6](-[#7]-[#7]-[#6](=O)-c1cc2ccccc2cc1-[#8])=[#6]-1\[#6](=O)-c2ccccc2-[#6]-1=O