Reaction Details
TargetInduced myeloid leukemia cell differentiation protein Mcl-1
LigandBDBM33145
Substrate/Competitorn/a
Meas. Tech.Dose Response Confirmation for Mcl-1/Noxa Interaction Inhibitors
IC50 7327.527245±n/a nM
Citation PubChem, PC Dose Response Confirmation for Mcl-1/Noxa Interaction Inhibitors PubChem Bioassay(2008)[AID]
 
Induced myeloid leukemia cell differentiation protein Mcl-1
Name:Induced myeloid leukemia cell differentiation protein Mcl-1
Type:Membrane; Single-pass membrane protein
Mol. Mass.:37332.87
Organism:Homo sapiens (Human)
Description:Q07820
Residue:350
BDBM33145
NameBDBM33145
Synonyms:3-[[[(E)-(2,3-dihydroxy-4-keto-cyclohexa-2,5-dien-1-ylidene)methyl]amino]carbamoyl]-N,N-diethyl-benzenesulfonamide 3-[[[(E)-(2,3-dihydroxy-4-oxocyclohexa-2,5-dien-1-ylidene)methyl]amino]carbamoyl]-N,N-diethylbenzenesulfonamide 3-[[[(Z)-(2,3-dihydroxy-4-keto-cyclohexa-2,5-dien-1-ylidene)methyl]amino]carbamoyl]-N,N-diethyl-benzenesulfonamide SMR000244048 | cid_6263555
TypeSmall organic molecule
Emp. Form.C18H21N3O6S
Mol. Mass.407.441
SMILESCCN(CC)S(=O)(=O)c1cccc(c1)C(=O)NN=Cc1ccc(O)c(O)c1O