Reaction Details
TargetInduced myeloid leukemia cell differentiation protein Mcl-1
LigandBDBM50378
Substrate/Competitorn/a
Meas. Tech.Dose Response Confirmation for Mcl-1/Noxa Interaction Inhibitors
IC50 400±n/a nM
Citation PubChem, PC Dose Response Confirmation for Mcl-1/Noxa Interaction Inhibitors PubChem Bioassay(2008)[AID]
 
Induced myeloid leukemia cell differentiation protein Mcl-1
Name:Induced myeloid leukemia cell differentiation protein Mcl-1
Type:Membrane; Single-pass membrane protein
Mol. Mass.:37332.87
Organism:Homo sapiens (Human)
Description:Q07820
Residue:350
BDBM50378
NameBDBM50378
Synonyms:(E)-N-[4-(dimethylamino)phenyl]-3-(5-methyl-2-furanyl)-2-propenamide (E)-N-[4-(dimethylamino)phenyl]-3-(5-methylfuran-2-yl)prop-2-enamide SMR000272473 | cid_888046
TypeSmall organic molecule
Emp. Form.C16H18N2O2
Mol. Mass.270.3263
SMILESCN(C)c1ccc(NC(=O)\C=C\c2ccc(C)o2)cc1