Reaction Details
TargetInduced myeloid leukemia cell differentiation protein Mcl-1
LigandBDBM50417
Substrate/Competitorn/a
Meas. Tech.Dose Response Confirmation for Mcl-1/Noxa Interaction Inhibitors
IC50 400±n/a nM
Citation PubChem, PC Dose Response Confirmation for Mcl-1/Noxa Interaction Inhibitors PubChem Bioassay(2008)[AID]
 
Induced myeloid leukemia cell differentiation protein Mcl-1
Name:Induced myeloid leukemia cell differentiation protein Mcl-1
Type:Membrane; Single-pass membrane protein
Mol. Mass.:37332.87
Organism:Homo sapiens (Human)
Description:Q07820
Residue:350
BDBM50417
NameBDBM50417
Synonyms:3-hydroxy-2-[(3-methoxyphenyl)-(2-pyridylamino)methyl]-6-methylol-pyran-4-one 3-hydroxy-6-(hydroxymethyl)-2-[(3-methoxyphenyl)-(2-pyridinylamino)methyl]-4-pyranone 6-(hydroxymethyl)-2-[(3-methoxyphenyl)-(pyridin-2-ylamino)methyl]-3-oxidanyl-pyran-4-one SMR000306561 | cid_4108280
TypeSmall organic molecule
Emp. Form.C19H18N2O5
Mol. Mass.354.3566
SMILESCOc1cccc(c1)C(Nc1ccccn1)c1oc(CO)cc(=O)c1O