Reaction Details
TargetInduced myeloid leukemia cell differentiation protein Mcl-1
LigandBDBM48813
Substrate/Competitorn/a
Meas. Tech.Dose Response Confirmation for Mcl-1/Noxa Interaction Inhibitors
IC50 1557.941294±n/a nM
Citation PubChem, PC Dose Response Confirmation for Mcl-1/Noxa Interaction Inhibitors PubChem Bioassay(2008)[AID]
 
Induced myeloid leukemia cell differentiation protein Mcl-1
Name:Induced myeloid leukemia cell differentiation protein Mcl-1
Type:Membrane; Single-pass membrane protein
Mol. Mass.:37332.87
Organism:Homo sapiens (Human)
Description:Q07820
Residue:350
BDBM48813
NameBDBM48813
Synonyms:2-chloranyl-5-[5-[(Z)-[3-[(4-methoxyphenyl)methyl]-4-oxidanylidene-2-sulfanylidene-1,3-thiazolidin-5-ylidene]methyl]furan-2-yl]benzoic acid 2-chloro-5-[5-[(Z)-(4-keto-3-p-anisyl-2-thioxo-thiazolidin-5-ylidene)methyl]-2-furyl]benzoic acid 2-chloro-5-[5-[(Z)-[3-[(4-methoxyphenyl)methyl]-4-oxo-2-sulfanylidene-5-thiazolidinylidene]methyl]-2-furanyl]benzoic acid SMR000298745 | cid_2285453
TypeSmall organic molecule
Emp. Form.C23H16ClNO5S2
Mol. Mass.485.96
SMILESCOc1ccc(CN2C(=S)S\C(=C/c3ccc(o3)-c3ccc(Cl)c(c3)C(O)=O)C2=O)cc1