Reaction Details
TargetInduced myeloid leukemia cell differentiation protein Mcl-1
LigandBDBM48879
Substrate/Competitorn/a
Meas. Tech.Dose Response Confirmation for Mcl-1/Noxa Interaction Inhibitors
IC50 400±n/a nM
Citation PubChem, PC Dose Response Confirmation for Mcl-1/Noxa Interaction Inhibitors PubChem Bioassay(2008)[AID]
 
Induced myeloid leukemia cell differentiation protein Mcl-1
Name:Induced myeloid leukemia cell differentiation protein Mcl-1
Type:Membrane; Single-pass membrane protein
Mol. Mass.:37332.87
Organism:Homo sapiens (Human)
Description:Q07820
Residue:350
BDBM48879
NameBDBM48879
Synonyms:MLS000660477 N-(4-acetylphenyl)-2-[(2-nitro-3-thienyl)thio]acetamide N-(4-acetylphenyl)-2-[(2-nitrothien-3-yl)thio]acetamide SMR000309996 | cid_16195563
TypeSmall organic molecule
Emp. Form.C14H12N2O4S2
Mol. Mass.336.386
SMILESCC(=O)c1ccc(NC(=O)CSc2ccsc2[N+]([O-])=O)cc1