Reaction Details
TargetInduced myeloid leukemia cell differentiation protein Mcl-1
LigandBDBM47815
Substrate/Competitorn/a
Meas. Tech.Dose Response Confirmation for Mcl-1/Noxa Interaction Inhibitors
IC50 5429.819438±n/a nM
Citation PubChem, PC Dose Response Confirmation for Mcl-1/Noxa Interaction Inhibitors PubChem Bioassay(2008)[AID]
 
Induced myeloid leukemia cell differentiation protein Mcl-1
Name:Induced myeloid leukemia cell differentiation protein Mcl-1
Type:Membrane; Single-pass membrane protein
Mol. Mass.:37332.87
Organism:Homo sapiens (Human)
Description:Q07820
Residue:350
BDBM47815
NameBDBM47815
Synonyms:2-(4-Methoxy-phenyl)-[1,4]benzoquinone 2-(4-methoxyphenyl)cyclohexa-2,5-diene-1,4-dione SMR000427749 | cid_121637
TypeSmall organic molecule
Emp. Form.C13H10O3
Mol. Mass.214.2167
SMILESCOc1ccc(cc1)C1=CC(=O)C=CC1=O