Reaction Details
TargetInduced myeloid leukemia cell differentiation protein Mcl-1
LigandBDBM50622
Substrate/Competitorn/a
Meas. Tech.Dose Response Confirmation for Mcl-1/Noxa Interaction Inhibitors
IC50 718.9148±n/a nM
Citation PubChem, PC Dose Response Confirmation for Mcl-1/Noxa Interaction Inhibitors PubChem Bioassay(2008)[AID]
 
Induced myeloid leukemia cell differentiation protein Mcl-1
Name:Induced myeloid leukemia cell differentiation protein Mcl-1
Type:Membrane; Single-pass membrane protein
Mol. Mass.:37332.87
Organism:Homo sapiens (Human)
Description:Q07820
Residue:350
BDBM50622
NameBDBM50622
Synonyms:2-(phenylcarbonyl)cyclohexan-1-one 2-benzoyl-1-cyclohexanone 2-benzoylcyclohexanone SMR000420027 | cid_275627
TypeSmall organic molecule
Emp. Form.C13H14O2
Mol. Mass.202.2491
SMILESO=C(C1CCCCC1=O)c1ccccc1