Reaction Details
TargetInduced myeloid leukemia cell differentiation protein Mcl-1
LigandBDBM50640
Substrate/Competitorn/a
Meas. Tech.Dose Response Confirmation for Mcl-1/Noxa Interaction Inhibitors
IC50 6249.453516±n/a nM
Citation PubChem, PC Dose Response Confirmation for Mcl-1/Noxa Interaction Inhibitors PubChem Bioassay(2008)[AID]
 
Induced myeloid leukemia cell differentiation protein Mcl-1
Name:Induced myeloid leukemia cell differentiation protein Mcl-1
Type:Membrane; Single-pass membrane protein
Mol. Mass.:37332.87
Organism:Homo sapiens (Human)
Description:Q07820
Residue:350
BDBM50640
NameBDBM50640
Synonyms:2-chloranyl-3-(1H-indazol-6-ylamino)naphthalene-1,4-dione 2-chloro-3-(1H-indazol-6-ylamino)naphthalene-1,4-dione SMR000528477 | cid_265940
TypeSmall organic molecule
Emp. Form.C17H10ClN3O2
Mol. Mass.323.733
SMILESClC1=C(Nc2ccc3cn[nH]c3c2)C(=O)c2ccccc2C1=O