Reaction Details
TargetGlycoprotein 42
LigandBDBM44436
Substrate/Competitorn/a
Meas. Tech.Dose Response Confirmation for Small Molecule Inhibitors of Epstein-Barr Virus
IC50 1900±n/a nM
Citation PubChem, PC Dose Response Confirmation for Small Molecule Inhibitors of Epstein-Barr Virus PubChem Bioassay(2008)[AID]
 
Glycoprotein 42
Name:Glycoprotein 42
Type:Enzyme Catalytic Domain
Mol. Mass.:25424.12
Organism:Human herpesvirus 4 type 2
Description:gi_139424501
Residue:223
BDBM44436
NameBDBM44436
Synonyms:3-phenyl-1-propyl-pyrazolo[4,3-b]quinoxaline MLS000040578 cid_664831
TypeSmall organic molecule
Emp. Form.C18H16N4
Mol. Mass.288.3464
SMILESCCCn1nc(-c2ccccc2)c2nc3ccccc3nc12