Reaction Details
TargetGlycoprotein 42
LigandBDBM50925
Substrate/Competitorn/a
Meas. Tech.Dose Response Confirmation for Small Molecule Inhibitors of Epstein-Barr Virus
IC50 3700±n/a nM
Citation PubChem, PC Dose Response Confirmation for Small Molecule Inhibitors of Epstein-Barr Virus PubChem Bioassay(2008)[AID]
 
Glycoprotein 42
Name:Glycoprotein 42
Type:Enzyme Catalytic Domain
Mol. Mass.:25424.12
Organism:Human herpesvirus 4 type 2
Description:gi_139424501
Residue:223
BDBM50925
NameBDBM50925
Synonyms:5-methyl-4-phenyl-cyclopenta[c]quinolizine-1,2-dicarboxylic acid dimethyl ester MLS000537611 cid_990753 dimethyl 5-methyl-4-phenylcyclopenta[c]quinolizine-1,2-dicarboxylate
TypeSmall organic molecule
Emp. Form.C23H19NO4
Mol. Mass.373.4013
SMILESCOC(=O)c1cc2c(-c3ccccc3)c(C)c3ccccn3c2c1C(=O)OC