Reaction Details
TargetGlycoprotein 42
LigandBDBM46590
Substrate/Competitorn/a
Meas. Tech.Dose Response Confirmation for Small Molecule Inhibitors of Epstein-Barr Virus
IC50 3330±n/a nM
Citation PubChem, PC Dose Response Confirmation for Small Molecule Inhibitors of Epstein-Barr Virus PubChem Bioassay(2008)[AID]
 
Glycoprotein 42
Name:Glycoprotein 42
Type:Enzyme Catalytic Domain
Mol. Mass.:25424.12
Organism:Human herpesvirus 4 type 2
Description:gi_139424501
Residue:223
BDBM46590
NameBDBM46590
Synonyms:4-[2-[(E)-(2,3-dihydroxy-4-oxocyclohexa-2,5-dien-1-ylidene)methyl]hydrazinyl]-3-nitrobenzenesulfonamide 4-[N'-[(E)-(2,3-dihydroxy-4-keto-cyclohexa-2,5-dien-1-ylidene)methyl]hydrazino]-3-nitro-benzenesulfonamide MLS000759826 cid_5982653
TypeSmall organic molecule
Emp. Form.C13H12N4O7S
Mol. Mass.368.322
SMILESNS(=O)(=O)c1ccc(N=[NH+]Cc2ccc([O-])c(O)c2O)c(c1)[N+]([O-])=O