Reaction Details
TargetGlycoprotein 42
LigandBDBM51305
Substrate/Competitorn/a
Meas. Tech.Dose Response Confirmation for Small Molecule Inhibitors of Epstein-Barr Virus
IC50 1030±n/a nM
Citation PubChem, PC Dose Response Confirmation for Small Molecule Inhibitors of Epstein-Barr Virus PubChem Bioassay(2008)[AID]
 
Glycoprotein 42
Name:Glycoprotein 42
Type:Enzyme Catalytic Domain
Mol. Mass.:25424.12
Organism:Human herpesvirus 4 type 2
Description:gi_139424501
Residue:223
BDBM51305
NameBDBM51305
Synonyms:3,5-diphenyl-2-(trifluoromethyl)-1H-pyrazolo[1,5-a]pyrimidin-7-one CHEMBL522946 SMR000456169 | cid_2810970
TypeSmall organic molecule
Emp. Form.C19H12F3N3O
Mol. Mass.355.3133
SMILESFC(F)(F)c1[nH]n2c(nc(cc2=O)-c2ccccc2)c1-c1ccccc1