Reaction Details
TargetDNA repair protein RAD51 homolog 1
LigandBDBM43856
Substrate/Competitorn/a
Meas. Tech.Homologous recombination_Rad 51_dose response_2
IC50 53000±n/a nM
Citation PubChem, PC Homologous recombination_Rad 51_dose response_2 PubChem Bioassay(2008)[AID]
 
DNA repair protein RAD51 homolog 1
Name:DNA repair protein RAD51 homolog 1
Type:Enzyme Catalytic Domain
Mol. Mass.:36960.74
Organism:Homo sapiens (Human)
Description:gi_49168602
Residue:339
BDBM43856
NameBDBM43856
Synonyms:4-ethoxy-N-[(6-fluoro-1,1-diketo-2,3-dihydrothiochromen-4-ylidene)amino]benzenesulfonamide 4-ethoxy-N-[(6-fluoro-1,1-dioxo-2,3-dihydrothiochromen-4-ylidene)amino]benzenesulfonamide MLS000761277 SMR000369580 | cid_3596078
TypeSmall organic molecule
Emp. Form.C17H17FN2O5S2
Mol. Mass.412.456
SMILESCCOc1ccc(cc1)S(=O)(=O)NN=C1CCS(=O)(=O)c2ccc(F)cc12