Reaction Details
TargetE3 ubiquitin-protein ligase Mdm2
LigandBDBM43491
Substrate/Competitorn/a
Meas. Tech.E3 Ligase_Mutant_Dose Response
EC50 648330±n/a nM
Citation PubChem, PC E3 Ligase_Mutant_Dose Response PubChem Bioassay(2008)[AID]
 
E3 ubiquitin-protein ligase Mdm2
Name:E3 ubiquitin-protein ligase Mdm2
Type:Oncoprotein
Mol. Mass.:55196.54
Organism:Homo sapiens (Human)
Description:Q00987
Residue:491
BDBM43491
NameBDBM43491
Synonyms:(3E,5E)-3,5-bis(3,4,5-trimethoxybenzylidene)tetrahydropyran-4-one (3E,5E)-3,5-bis[(3,4,5-trimethoxyphenyl)methylidene]oxan-4-one MLS000860258 cid_5703458
TypeSmall organic molecule
Emp. Form.C25H28O8
Mol. Mass.456.485
SMILESCOc1cc(\C=C2/COC\C(=C/c3cc(OC)c(OC)c(OC)c3)C2=O)cc(OC)c1OC