Reaction Details
TargetAlkaline phosphatase, tissue-nonspecific isozyme
LigandBDBM43791
Substrate/Competitorn/a
Meas. Tech.SAR assay for compounds activating TNAP in the presence of 100 mM DEA performed in a luminescence assay
EC50 4440±n/a nM
Citation PubChem, PC SAR assay for compounds activating TNAP in the presence of 100 mM DEA performed in a luminescence assay PubChem Bioassay(2009)[AID]
 
Alkaline phosphatase, tissue-nonspecific isozyme
Name:Alkaline phosphatase, tissue-nonspecific isozyme
Type:PROTEIN
Mol. Mass.:57306.17
Organism:Homo sapiens (Human)
Description:ChEMBL_1448917
Residue:524
BDBM43791
NameBDBM43791
Synonyms:MLS-0240697.0001 N-(3-ethoxypropyl)-4-[2-(2-methyl-[1,2,4]triazolo[1,5-c]quinazolin-5-yl)hydrazinyl]-4-oxidanylidene-butanamide N-(3-ethoxypropyl)-4-keto-4-[N'-(2-methyl-[1,2,4]triazolo[1,5-c]quinazolin-5-yl)hydrazino]butyramide | cid_16009019
TypeSmall organic molecule
Emp. Form.C19H25N7O3
Mol. Mass.399.4469
SMILESCCOCCCNC(=O)CCC(=O)NNc1nc2ccccc2c2nc(C)nn12