Reaction Details
TargetAlkaline phosphatase, tissue-nonspecific isozyme
LigandBDBM43794
Substrate/Competitorn/a
Meas. Tech.SAR assay for compounds activating TNAP in the presence of 100 mM DEA performed in a luminescence assay
EC50 4270±n/a nM
Citation PubChem, PC SAR assay for compounds activating TNAP in the presence of 100 mM DEA performed in a luminescence assay PubChem Bioassay(2009)[AID]
 
Alkaline phosphatase, tissue-nonspecific isozyme
Name:Alkaline phosphatase, tissue-nonspecific isozyme
Type:PROTEIN
Mol. Mass.:57306.17
Organism:Homo sapiens (Human)
Description:ChEMBL_1448917
Residue:524
BDBM43794
NameBDBM43794
Synonyms:MLS-0239623.0001 N'-[1-(4-methylphenyl)pyrazolo[3,4-d]pyrimidin-4-yl]acetohydrazide N'-[1-(p-tolyl)pyrazolo[3,4-d]pyrimidin-4-yl]acetohydrazide | cid_4975892
TypeSmall organic molecule
Emp. Form.C14H14N6O
Mol. Mass.282.3006
SMILESCC(=O)NNc1ncnc2n(ncc12)-c1ccc(C)cc1