Reaction Details
TargetAlkaline phosphatase, tissue-nonspecific isozyme
LigandBDBM32715
Substrate/Competitorn/a
Meas. Tech.SAR assay for compounds activating TNAP in the presence of 100 mM DEA performed in a luminescence assay
EC50 4140±n/a nM
Citation PubChem, PC SAR assay for compounds activating TNAP in the presence of 100 mM DEA performed in a luminescence assay PubChem Bioassay(2009)[AID]
 
Alkaline phosphatase, tissue-nonspecific isozyme
Name:Alkaline phosphatase, tissue-nonspecific isozyme
Type:PROTEIN
Mol. Mass.:57306.17
Organism:Homo sapiens (Human)
Description:ChEMBL_1448917
Residue:524
BDBM32715
NameBDBM32715
Synonyms:2-(5-keto-3-methyl-3-pyrazolin-1-yl)-6-methyl-1H-pyrimidin-4-one 6-methyl-2-(5-methyl-3-oxidanylidene-1H-pyrazol-2-yl)-1H-pyrimidin-4-one MLS000544953 cid_4371854
TypeSmall organic molecule
Emp. Form.C9H10N4O2
Mol. Mass.206.2013
SMILESCc1cc(=O)n([nH]1)-c1nc(C)cc(=O)[nH]1