Reaction Details
TargetAlkaline phosphatase, tissue-nonspecific isozyme
LigandBDBM51404
Substrate/Competitorn/a
Meas. Tech.SAR assay for compounds activating TNAP in the presence of 100 mM DEA performed in a luminescence assay
EC50 3660±n/a nM
Citation PubChem, PC SAR assay for compounds activating TNAP in the presence of 100 mM DEA performed in a luminescence assay PubChem Bioassay(2009)[AID]
 
Alkaline phosphatase, tissue-nonspecific isozyme
Name:Alkaline phosphatase, tissue-nonspecific isozyme
Type:PROTEIN
Mol. Mass.:57306.17
Organism:Homo sapiens (Human)
Description:ChEMBL_1448917
Residue:524
BDBM51404
NameBDBM51404
Synonyms:2-(4-methylphenyl)sulfanyl-N-(1H-1,2,4-triazol-5-yl)propanamide 2-[(4-methylphenyl)thio]-N-(1H-1,2,4-triazol-5-yl)propanamide cid_2977752
TypeSmall organic molecule
Emp. Form.C12H14N4OS
Mol. Mass.262.331
SMILESCC(Sc1ccc(C)cc1)C(=O)Nc1nnc[nH]1