Reaction Details
TargetAlkaline phosphatase, tissue-nonspecific isozyme
LigandBDBM51405
Substrate/Competitorn/a
Meas. Tech.SAR assay for compounds activating TNAP in the presence of 100 mM DEA performed in a luminescence assay
EC50 4080±n/a nM
Citation PubChem, PC SAR assay for compounds activating TNAP in the presence of 100 mM DEA performed in a luminescence assay PubChem Bioassay(2009)[AID]
 
Alkaline phosphatase, tissue-nonspecific isozyme
Name:Alkaline phosphatase, tissue-nonspecific isozyme
Type:PROTEIN
Mol. Mass.:57306.17
Organism:Homo sapiens (Human)
Description:ChEMBL_1448917
Residue:524
BDBM51405
NameBDBM51405
Synonyms:4-(4-methoxyphenoxy)-N-(1H-1,2,4-triazol-5-yl)butanamide MLS-0238775.0001 | cid_1568913
TypeSmall organic molecule
Emp. Form.C13H16N4O3
Mol. Mass.276.2911
SMILESCOc1ccc(OCCCC(=O)Nc2nnc[nH]2)cc1