Reaction Details
TargetAlkaline phosphatase, tissue-nonspecific isozyme
LigandBDBM51409
Substrate/Competitorn/a
Meas. Tech.SAR assay for compounds activating TNAP in the presence of 100 mM DEA performed in a luminescence assay
EC50 2830±n/a nM
Citation PubChem, PC SAR assay for compounds activating TNAP in the presence of 100 mM DEA performed in a luminescence assay PubChem Bioassay(2009)[AID]
 
Alkaline phosphatase, tissue-nonspecific isozyme
Name:Alkaline phosphatase, tissue-nonspecific isozyme
Type:PROTEIN
Mol. Mass.:57306.17
Organism:Homo sapiens (Human)
Description:ChEMBL_1448917
Residue:524
BDBM51409
NameBDBM51409
Synonyms:3-(4-morpholinylsulfonyl)-N-(1H-1,2,4-triazol-5-yl)benzamide 3-morpholinosulfonyl-N-(1H-1,2,4-triazol-5-yl)benzamide cid_4060668
TypeSmall organic molecule
Emp. Form.C13H15N5O4S
Mol. Mass.337.354
SMILESO=C(Nc1nnc[nH]1)c1cccc(c1)S(=O)(=O)N1CCOCC1