Reaction Details
TargetAlkaline phosphatase, tissue-nonspecific isozyme
LigandBDBM51410
Substrate/Competitorn/a
Meas. Tech.SAR assay for compounds activating TNAP in the presence of 100 mM DEA performed in a luminescence assay
EC50 3030±n/a nM
Citation PubChem, PC SAR assay for compounds activating TNAP in the presence of 100 mM DEA performed in a luminescence assay PubChem Bioassay(2009)[AID]
 
Alkaline phosphatase, tissue-nonspecific isozyme
Name:Alkaline phosphatase, tissue-nonspecific isozyme
Type:PROTEIN
Mol. Mass.:57306.17
Organism:Homo sapiens (Human)
Description:ChEMBL_1448917
Residue:524
BDBM51410
NameBDBM51410
Synonyms:2-chloranyl-N-(1H-1,2,4-triazol-5-yl)-5-[[3-(trifluoromethyl)phenyl]sulfamoyl]benzamide MLS-0270876.0001 | cid_2344226
TypeSmall organic molecule
Emp. Form.C16H11ClF3N5O3S
Mol. Mass.445.803
SMILESFC(F)(F)c1cccc(NS(=O)(=O)c2ccc(Cl)c(c2)C(=O)Nc2nnc[nH]2)c1