Reaction Details
TargetAlkaline phosphatase, tissue-nonspecific isozyme
LigandBDBM44816
Substrate/Competitorn/a
Meas. Tech.SAR assay for compounds activating TNAP in the presence of 100 mM DEA performed in a luminescence assay
EC50 3560±n/a nM
Citation PubChem, PC SAR assay for compounds activating TNAP in the presence of 100 mM DEA performed in a luminescence assay PubChem Bioassay(2009)[AID]
 
Alkaline phosphatase, tissue-nonspecific isozyme
Name:Alkaline phosphatase, tissue-nonspecific isozyme
Type:PROTEIN
Mol. Mass.:57306.17
Organism:Homo sapiens (Human)
Description:ChEMBL_1448917
Residue:524
BDBM44816
NameBDBM44816
Synonyms:2-(4-bromanyl-2-tert-butyl-phenoxy)-N-(1H-1,2,4-triazol-5-yl)ethanamide 2-(4-bromo-2-tert-butylphenoxy)-N-(1H-1,2,4-triazol-5-yl)acetamide SMR000104316 | cid_1119557
TypeSmall organic molecule
Emp. Form.C14H17BrN4O2
Mol. Mass.353.214
SMILESCC(C)(C)c1cc(Br)ccc1OCC(=O)Nc1nnc[nH]1