Reaction Details
TargetAlkaline phosphatase, tissue-nonspecific isozyme
LigandBDBM51412
Substrate/Competitorn/a
Meas. Tech.SAR assay for compounds activating TNAP in the presence of 100 mM DEA performed in a luminescence assay
EC50 4170±n/a nM
Citation PubChem, PC SAR assay for compounds activating TNAP in the presence of 100 mM DEA performed in a luminescence assay PubChem Bioassay(2009)[AID]
 
Alkaline phosphatase, tissue-nonspecific isozyme
Name:Alkaline phosphatase, tissue-nonspecific isozyme
Type:PROTEIN
Mol. Mass.:57306.17
Organism:Homo sapiens (Human)
Description:ChEMBL_1448917
Residue:524
BDBM51412
NameBDBM51412
Synonyms:2-(4-ethylphenoxy)-N-(1H-1,2,4-triazol-5-yl)acetamide MLS-0265844.0001 | cid_698942
TypeSmall organic molecule
Emp. Form.C12H14N4O2
Mol. Mass.246.2652
SMILESCCc1ccc(OCC(=O)Nc2nnc[nH]2)cc1