Reaction Details
TargetAlkaline phosphatase, tissue-nonspecific isozyme
LigandBDBM51414
Substrate/Competitorn/a
Meas. Tech.SAR assay for compounds activating TNAP in the presence of 100 mM DEA performed in a luminescence assay
EC50 4430±n/a nM
Citation PubChem, PC SAR assay for compounds activating TNAP in the presence of 100 mM DEA performed in a luminescence assay PubChem Bioassay(2009)[AID]
 
Alkaline phosphatase, tissue-nonspecific isozyme
Name:Alkaline phosphatase, tissue-nonspecific isozyme
Type:PROTEIN
Mol. Mass.:57306.17
Organism:Homo sapiens (Human)
Description:ChEMBL_1448917
Residue:524
BDBM51414
NameBDBM51414
Synonyms:2-(4-bromanylphenoxy)-N-(1H-1,2,4-triazol-5-yl)ethanamide MLS-0315835.0001 | cid_718673
TypeSmall organic molecule
Emp. Form.C10H9BrN4O2
Mol. Mass.297.108
SMILESBrc1ccc(OCC(=O)Nc2nnc[nH]2)cc1