Reaction Details
TargetAlkaline phosphatase, tissue-nonspecific isozyme
LigandBDBM51420
Substrate/Competitorn/a
Meas. Tech.SAR assay for compounds activating TNAP in the presence of 100 mM DEA performed in a luminescence assay
EC50 3820±n/a nM
Citation PubChem, PC SAR assay for compounds activating TNAP in the presence of 100 mM DEA performed in a luminescence assay PubChem Bioassay(2009)[AID]
 
Alkaline phosphatase, tissue-nonspecific isozyme
Name:Alkaline phosphatase, tissue-nonspecific isozyme
Type:PROTEIN
Mol. Mass.:57306.17
Organism:Homo sapiens (Human)
Description:ChEMBL_1448917
Residue:524
BDBM51420
NameBDBM51420
Synonyms:3,5-dimethoxy-N-(1H-1,2,4-triazol-5-yl)benzamide cid_702927
TypeSmall organic molecule
Emp. Form.C11H12N4O3
Mol. Mass.248.238
SMILESCOc1cc(OC)cc(c1)C(=O)Nc1nnc[nH]1