Reaction Details
TargetAlkaline phosphatase, tissue-nonspecific isozyme
LigandBDBM51428
Substrate/Competitorn/a
Meas. Tech.SAR assay for compounds activating TNAP in the presence of 100 mM DEA performed in a luminescence assay
EC50 4370±n/a nM
Citation PubChem, PC SAR assay for compounds activating TNAP in the presence of 100 mM DEA performed in a luminescence assay PubChem Bioassay(2009)[AID]
 
Alkaline phosphatase, tissue-nonspecific isozyme
Name:Alkaline phosphatase, tissue-nonspecific isozyme
Type:PROTEIN
Mol. Mass.:57306.17
Organism:Homo sapiens (Human)
Description:ChEMBL_1448917
Residue:524
BDBM51428
NameBDBM51428
Synonyms:2,4-bis(chloranyl)-N-(1H-1,2,4-triazol-5-yl)benzamide MLS-0255130.0001 | cid_3959697
TypeSmall organic molecule
Emp. Form.C9H6Cl2N4O
Mol. Mass.257.076
SMILESClc1ccc(C(=O)Nc2nnc[nH]2)c(Cl)c1