Reaction Details
TargetAlkaline phosphatase, tissue-nonspecific isozyme
LigandBDBM46433
Substrate/Competitorn/a
Meas. Tech.SAR assay for compounds activating TNAP in the presence of 100 mM DEA performed in a luminescence assay
EC50 300±n/a nM
Citation PubChem, PC SAR assay for compounds activating TNAP in the presence of 100 mM DEA performed in a luminescence assay PubChem Bioassay(2009)[AID]
 
Alkaline phosphatase, tissue-nonspecific isozyme
Name:Alkaline phosphatase, tissue-nonspecific isozyme
Type:PROTEIN
Mol. Mass.:57306.17
Organism:Homo sapiens (Human)
Description:ChEMBL_1448917
Residue:524
BDBM46433
NameBDBM46433
Synonyms:5'-nitro-2'-spiro[1,2-dihydro-4,1,2-benzoxadiazine-3,3'-1H-indole]one 5'-nitrospiro[1,2-dihydro-4,1,2-benzoxadiazine-3,3'-indoline]-2'-one cid_3921071
TypeSmall organic molecule
Emp. Form.C14H10N4O4
Mol. Mass.298.2536
SMILES[O-][N+](=O)c1ccc2NC(=O)C3(NNc4ccccc4O3)c2c1