Reaction Details
TargetAlkaline phosphatase, tissue-nonspecific isozyme
LigandBDBM46434
Substrate/Competitorn/a
Meas. Tech.SAR assay for compounds activating TNAP in the presence of 100 mM DEA performed in a luminescence assay
EC50 740±n/a nM
Citation PubChem, PC SAR assay for compounds activating TNAP in the presence of 100 mM DEA performed in a luminescence assay PubChem Bioassay(2009)[AID]
 
Alkaline phosphatase, tissue-nonspecific isozyme
Name:Alkaline phosphatase, tissue-nonspecific isozyme
Type:PROTEIN
Mol. Mass.:57306.17
Organism:Homo sapiens (Human)
Description:ChEMBL_1448917
Residue:524
BDBM46434
NameBDBM46434
Synonyms:1'-(phenylmethyl)-2'-spiro[1,2-dihydro-4,1,2-benzoxadiazine-3,3'-indole]one 1'-benzylspiro[1,2-dihydro-4,1,2-benzoxadiazine-3,3'-indole]-2'-one MLS-0315871.0001 | cid_4879301
TypeSmall organic molecule
Emp. Form.C21H17N3O2
Mol. Mass.343.3786
SMILESO=C1N(Cc2ccccc2)c2ccccc2C11NNc2ccccc2O1