Reaction Details
TargetAlkaline phosphatase, tissue-nonspecific isozyme
LigandBDBM46435
Substrate/Competitorn/a
Meas. Tech.SAR assay for compounds activating TNAP in the presence of 100 mM DEA performed in a luminescence assay
EC50 242±n/a nM
Citation PubChem, PC SAR assay for compounds activating TNAP in the presence of 100 mM DEA performed in a luminescence assay PubChem Bioassay(2009)[AID]
 
Alkaline phosphatase, tissue-nonspecific isozyme
Name:Alkaline phosphatase, tissue-nonspecific isozyme
Type:PROTEIN
Mol. Mass.:57306.17
Organism:Homo sapiens (Human)
Description:ChEMBL_1448917
Residue:524
BDBM46435
NameBDBM46435
Synonyms:1'-ethyl-2'-spiro[1,2-dihydro-4,1,2-benzoxadiazine-3,3'-indole]one 1'-ethylspiro[1,2-dihydro-4,1,2-benzoxadiazine-3,3'-indoline]-2'-one cid_4879425
TypeSmall organic molecule
Emp. Form.C16H15N3O2
Mol. Mass.281.3092
SMILESCCN1C(=O)C2(NNc3ccccc3O2)c2ccccc12