Reaction Details
TargetAlkaline phosphatase, tissue-nonspecific isozyme
LigandBDBM51446
Substrate/Competitorn/a
Meas. Tech.SAR assay for compounds activating TNAP in the presence of 100 mM DEA performed in a luminescence assay
EC50 3480±n/a nM
Citation PubChem, PC SAR assay for compounds activating TNAP in the presence of 100 mM DEA performed in a luminescence assay PubChem Bioassay(2009)[AID]
 
Alkaline phosphatase, tissue-nonspecific isozyme
Name:Alkaline phosphatase, tissue-nonspecific isozyme
Type:PROTEIN
Mol. Mass.:57306.17
Organism:Homo sapiens (Human)
Description:ChEMBL_1448917
Residue:524
BDBM51446
NameBDBM51446
Synonyms:2-(4-methoxyphenoxy)-N-(1H-1,2,4-triazol-5-yl)propanamide MLS-0315832.0001 | cid_2886278
TypeSmall organic molecule
Emp. Form.C12H14N4O3
Mol. Mass.262.2646
SMILESCOc1ccc(OC(C)C(=O)Nc2nnc[nH]2)cc1