Reaction Details
TargetAlkaline phosphatase, tissue-nonspecific isozyme
LigandBDBM43817
Substrate/Competitorn/a
Meas. Tech.SAR assay for compounds activating TNAP in the presence of 100 mM DEA performed in a luminescence assay
EC50 385±n/a nM
Citation PubChem, PC SAR assay for compounds activating TNAP in the presence of 100 mM DEA performed in a luminescence assay PubChem Bioassay(2009)[AID]
 
Alkaline phosphatase, tissue-nonspecific isozyme
Name:Alkaline phosphatase, tissue-nonspecific isozyme
Type:PROTEIN
Mol. Mass.:57306.17
Organism:Homo sapiens (Human)
Description:ChEMBL_1448917
Residue:524
BDBM43817
NameBDBM43817
Synonyms:(3Z)-1-allyl-3-[(2-hydroxyphenyl)hydrazono]oxindole (3Z)-3-[(2-hydroxyphenyl)hydrazinylidene]-1-prop-2-enyl-indol-2-one ML087 cid_25199559
TypeSmall organic molecule
Emp. Form.C17H15N3O2
Mol. Mass.293.3199
SMILESOc1ccccc1NN=C1C(=O)N(CC=C)c2ccccc12