Reaction Details
TargetRegulator of G-protein signaling 4
LigandBDBM47700
Substrate/Competitorn/a
Meas. Tech.Dose response, multiplexed high-throughput screen for small molecule regulators of RGS family protein interactions, specifically RGS4-Galphao.
EC50 30000±n/a nM
Citation PubChem, PC Dose response, multiplexed high-throughput screen for small molecule regulators of RGS family protein interactions, specifically RGS4-Galphao. PubChem Bioassay(2009)[AID]
 
Regulator of G-protein signaling 4
Name:Regulator of G-protein signaling 4
Type:Enzyme
Mol. Mass.:23263.51
Organism:Homo sapiens (Human)
Description:P49798
Residue:205
BDBM47700
NameBDBM47700
Synonyms:2-(4-methyl-1-piperidinyl)aniline MLS000080408 [2-(4-methylpiperidino)phenyl]amine | cid_663698
TypeSmall organic molecule
Emp. Form.C12H18N2
Mol. Mass.190.2847
SMILESCC1CCN(CC1)c1ccccc1N