Reaction Details
TargetRegulator of G-protein signaling 4
LigandBDBM47711
Substrate/Competitorn/a
Meas. Tech.Dose response, multiplexed high-throughput screen for small molecule regulators of RGS family protein interactions, specifically RGS4-Galphao.
EC50 30000±n/a nM
Citation PubChem, PC Dose response, multiplexed high-throughput screen for small molecule regulators of RGS family protein interactions, specifically RGS4-Galphao. PubChem Bioassay(2009)[AID]
 
Regulator of G-protein signaling 4
Name:Regulator of G-protein signaling 4
Type:Enzyme
Mol. Mass.:23263.51
Organism:Homo sapiens (Human)
Description:P49798
Residue:205
BDBM47711
NameBDBM47711
Synonyms:5-methyl-2-[[oxo(3-pyridinyl)methyl]amino]-3-thiophenecarboxylic acid methyl ester MLS000065647 cid_1245092 methyl 5-methyl-2-(pyridine-3-carbonylamino)thiophene-3-carboxylate | methyl 5-methyl-2-[(3-pyridinylcarbonyl)amino]-3-thiophenecarboxylate
TypeSmall organic molecule
Emp. Form.C13H12N2O3S
Mol. Mass.276.311
SMILESCOC(=O)c1cc(C)sc1NC(=O)c1cccnc1