Reaction Details
TargetDual specificity protein phosphatase 3
LigandBDBM34408
Substrate/Competitorn/a
Meas. Tech.Fluorescent assay for identification of compounds that inhibit VHR1
IC50 5730±n/a nM
Citation PubChem, PC Fluorescent assay for identification of compounds that inhibit VHR1 PubChem Bioassay(2009)[AID]
 
Dual specificity protein phosphatase 3
Name:Dual specificity protein phosphatase 3
Type:Hydrolase
Mol. Mass.:20480.58
Organism:Homo sapiens (Human)
Description:n/a
Residue:185
BDBM34408
NameBDBM34408
Synonyms:4-amino-3-(4-methylphenyl)-5-[(4-methyl-1-piperazinyl)carbonyl]-1,3-thiazole-2(3H)-thione SMR000072496 [4-amino-3-(4-methylphenyl)-2-sulfanylidene-5-thiazolyl]-(4-methyl-1-piperazinyl)methanone [4-azanyl-3-(4-methylphenyl)-2-sulfanylidene-1,3-thiazol-5-yl]-(4-methylpiperazin-1-yl)methanone | cid_889983
TypeSmall organic molecule
Emp. Form.C16H20N4OS2
Mol. Mass.348.486
SMILESCN1CCN(CC1)C(=O)c1sc(=S)n(c1N)-c1ccc(C)cc1