Reaction Details
TargetDual specificity protein phosphatase 3
LigandBDBM46226
Substrate/Competitorn/a
Meas. Tech.Fluorescent assay for identification of compounds that inhibit VHR1
IC50 1230±n/a nM
Citation PubChem, PC Fluorescent assay for identification of compounds that inhibit VHR1 PubChem Bioassay(2009)[AID]
 
Dual specificity protein phosphatase 3
Name:Dual specificity protein phosphatase 3
Type:Hydrolase
Mol. Mass.:20480.58
Organism:Homo sapiens (Human)
Description:n/a
Residue:185
BDBM46226
NameBDBM46226
Synonyms:MLS-0266887.0001 | cid_2545524
TypeSmall organic molecule
Emp. Form.C25H22N2O8S2
Mol. Mass.542.581
SMILESCCOC(=O)c1sc2nc3c(SCCC(O)=O)cc(cn3c(=O)c2c1C)C(=O)c1cc(OC)ccc1O